{"text_format":"1","workbook":"xlsx","n_sheets":15,"sheets":["最初","売上修正","仕入修正","取引計算表","売上仕入計算","本則付表1","本則付表2(2)","申告書本則","申告書簡易","決算書不動産","不動産売上仕入修正","簡易付表5(2)","簡易付表4","その他","作業表紙"],"not_rendered":{"charts":0,"images":3,"macros":1,"external_links":1,"defined_names":31,"comments":3,"pivot_tables":0},"unopened":[],"bounds":{"document_bytes":16777216,"sheet_cells":100000,"rows_first":2000,"rows_last":500,"rows_between":2000,"halvings":0,"cell_chars":16384,"cell_head_chars":4096},"cells_cut":0,"cells_raw":0,"read":"whole","date_system":"1900"}

{"sheet":"最初","index":0,"n_rows":22,"n_cols":9,"rows_kept":22,"cut":false,"hidden":false,"merged":[[0,1,0,5],[7,4,7,5],[4,4,4,5],[19,4,19,5],[21,1,22,5],[7,1,9,1],[9,4,9,5],[2,4,2,5],[11,2,13,2],[5,1,5,2]]}
[null,null,null,null,null,null,null,"個人簿記150210.xlsm\r\n","個人簿記150210.xlsm\r\n"]
[null,null,null,null,null,null,null,{"$f":"IF(RIGHT(H3,3)=\"xls\",\"xls\",IF(RIGHT(H3,4)=\"xlsm\",\"xlsm\",\"\"))","v":"xlsm"},{"$f":"IF(RIGHT(I3,3)=\"xls\",\"xls\",IF(RIGHT(I3,4)=\"xlsm\",\"xlsm\",\"\"))","v":"xlsm"}]
[null,"基準期間\n（2年前）の\n課税売上高",null,"←","当年（課税年）の２年前の課税売上高（非課税不課税売上高を控除した残額）。\n2年前の免税農家は、税込み価額で、課税対象農家は、税抜き価額で記入します。\n",null,null,{"$f":"CLEAN(H1)","v":"個人簿記150210.xlsm"},{"$f":"CLEAN(I1)","v":"個人簿記150210.xlsm"}]
[]
[null,"課税方式",null,null,"基本情報ページで課税方式を選択してください。",null,null,{"$f":"MID(CELL(\"filename\",A1),FIND(\"[\",CELL(\"filename\",A1))+1,FIND(\"]\",CELL(\"filename\",A1))-FIND(\"[\",CELL(\"filename\",A1))-1)","v":"個人簿記消費税.xlsm"}]
[]
[]
[null,"当年度は、どんな課税年度ですか？",null,"←","下記のメニューからお選びください。"]
{"$rows_left_out":15}
{"sheet":"売上修正","index":1,"n_rows":42,"n_cols":20,"rows_kept":42,"cut":false,"hidden":false,"merged":[[2,16,4,16],[2,17,4,17],[3,18,4,18],[3,19,4,19],[2,18,2,19],[2,15,4,15],[1,9,1,14],[2,8,4,9],[2,13,3,14],[2,10,4,10],[2,11,4,11],[2,12,4,12],[15,8,20,8],[5,8,12,8],[23,15,24,15],[25,8,28,8],[23,8,24,8],[23,9,24,9],[23,10,24,10],[23,13,23,14]]}
[]
[null,null,null,null,null,null,null,null,null,"消費税関係課税売上計算書"]
[null,null,null,null,null,null,null,null,"科目名",null,"金額","課税仕入になるもの","A\n差引金額","B　：Aのうち課税取引にならないもの",null,"C(A-B)\n課税売上額","4%","6.3%","課税仕入になるもの"]
[null,null,null,null,null,null,null,null,null,null,null,null,null,null,null,null,null,null,"利用高配当の減算処理","出荷奨励金の減算処理"]
[null,null,null,null,null,null,null,null,null,null,null,null,null,"非課税取引","不課税取引"]
[1,1,2,{"$f":"A6*10+B6","v":11},{"$f":"A6*10+C6","v":12},null,null,null,null,{"$f":"[1]決算書!C11","v":"販売金額(売上高)"},{"$f":"SUMIF([1]収益収入!$X$10:$X$4011,売上修正!A6,[1]収益収入!$F$10:$F$4011)+SUMIF([1]複合仕訳!$G$15:$M$15,A6,[1]複合仕訳!$G$4:$M$4)","v":0},{"$f":"SUM(S6:T6)","v":0},{"$f":"K6-L6","v":0},{"$f":"SUMIF([1]収益収入!$X$10:$X$4011,売上修正!A6,[1]収益収入!$AJ$10:$AJ$4011)+SUMIF([1]複合仕訳!$G$15:$M$15,A6,[1]複合仕訳!$G$5:$M$5)","v":0},{"$f":"SUMIF([1]収益収入!$X$10:$X$4011,売上修正!A6,[1]収益収入!$AK$10:$AK$4011)+SUMIF([1]複合仕訳!$G$15:$M$15,A6,[1]複合仕訳!$G$6:$M$6)","v":0},{"$f":"M6-N6-O6","v":0},{"$f":"SUMIF([1]収益収入!$AM$10:$AM$4011,売上修正!D6,[1]収益収入!$AL$10:$AL$4011)+SUMIF([1]複合仕訳!$AH$15:$AN$15,D6,[1]複合仕訳!$AH$17:$AN$17)-S6","v":0},{"$f":"SUMIF([1]収益収入!$AM$10:$AM$4011,売上修正!E6,[1]収益収入!$AL$10:$AL$4011)+SUMIF([1]複合仕訳!$AH$16:$AN$16,E6,[1]複合仕訳!$AH$18:$AN$18)","v":0}]
[2,1,2,{"$f":"A7*10+B7","v":21},{"$f":"A7*10+C7","v":22},null,null,null,null,{"$f":"[1]決算書!C12","v":"家 事 消 費\n事 業 消 費"},{"$f":"SUMIF([1]収益収入!$X$10:$X$4011,売上修正!A7,[1]収益収入!$F$10:$F$4011)","v":0},null,{"$f":"K7","v":0},{"$f":"SUMIF([1]収益収入!$X$10:$X$4011,売上修正!A7,[1]収益収入!$AJ$10:$AJ$4011)+SUMIF([1]複合仕訳!$G$15:$M$15,A7,[1]複合仕訳!$G$5:$M$5)","v":0},{"$f":"SUMIF([1]収益収入!$X$10:$X$4011,売上修正!A7,[1]収益収入!$AK$10:$AK$4011)+SUMIF([1]複合仕訳!$G$15:$M$15,A7,[1]複合仕訳!$G$6:$M$6)","v":0},0,{"$f":"SUMIF([1]収益収入!$AM$10:$AM$4011,売上修正!D7,[1]収益収入!$AL$10:$AL$4011)","v":0},{"$f":"SUMIF([1]収益収入!$AM$10:$AM$4011,売上修正!E7,[1]収益収入!$AL$10:$AL$4011)","v":0}]
[3,1,2,31,32,null,null,null,null,{"$f":"[1]決算書!C13","v":"雑収入"},{"$f":"SUMIF([1]収益収入!$X$10:$X$4011,A8,[1]収益収入!$F$10:$F$4011)+SUMIF([1]複合仕訳!$G$15:$M$15,A8,[1]複合仕訳!$G$4:$M$4)","v":0},{"$f":"SUM(S8:T8)","v":0},{"$f":"K8-L8","v":0},{"$f":"SUMIF([1]収益収入!$X$10:$X$4011,売上修正!A8,[1]収益収入!$AJ$10:$AJ$4011)+SUMIF([1]複合仕訳!$G$15:$M$15,A8,[1]複合仕訳!$G$5:$M$5)","v":0},{"$f":"SUMIF([1]収益収入!$X$10:$X$4011,売上修正!A8,[1]収益収入!$AK$10:$AK$4011)+SUMIF([1]複合仕訳!$G$15:$M$15,A8,[1]複合仕訳!$G$6:$M$6)","v":0},0,{"$f":"SUMIF([1]収益収入!$AM$10:$AM$4011,売上修正!D8,[1]収益収入!$AL$10:$AL$4011)+SUMIF([1]複合仕訳!$AH$15:$AN$15,D8,[1]複合仕訳!$AH$17:$AN$17)-(S8+T8)","v":0},{"$f":"SUMIF([1]収益収入!$AM$10:$AM$4011,売上修正!E8,[1]収益収入!$AL$10:$AL$4011)+SUMIF([1]複合仕訳!$AH$16:$AN$16,E8,[1]複合仕訳!$AH$18:$AN$18)","v":0}]
{"$rows_left_out":35}
{"sheet":"仕入修正","index":2,"n_rows":52,"n_cols":23,"rows_kept":52,"cut":false,"hidden":false,"merged":[[36,9,40,9],[34,9,35,9],[2,9,3,9],[1,10,1,11],[34,10,35,10],[34,11,35,11],[4,9,32,9],[2,13,3,13],[34,12,35,12],[34,13,35,13],[2,10,3,10],[2,11,3,11],[2,12,3,12],[4,22,9,22],[4,17,9,21],[14,19,15,19],[14,20,15,20],[10,17,16,17],[10,18,16,18],[10,19,13,19],[12,20,13,20],[12,21,13,21],[14,21,15,21],[19,21,20,21],[21,21,22,21],[21,20,22,20],[19,20,20,20],[17,17,23,17],[17,18,23,18],[17,19,20,19],[21,19,22,19]]}
[]
[null,null,null,null,null,null,null,null,null,null,"消費税関係課税仕入計算書\n(農業所得用＋業務用固定資産購入支出）"]
[null,null,null,null,null,null,null,null,null,null,"科目名","A　決算額","B　：　Aのうち課税取引にならないもの","C(A-B)\n課税仕入額"]
[null,null,null,null,null,null,null,null,null,null,null,null,null,null,"うち税率4％適用分","うち税率6.3％適用分"]
[1,null,null,null,1,2,{"$f":"$A5*10+E5","v":11},{"$f":"$A5*10+F5","v":12},null,"３種事業",{"$f":"IF(L5=0,\"***\",+[1]ﾒﾆｭｰ!H4)","v":"***"},{"$f":"SUMIF([1]費用支出!$X$10:$X$4011,仕入修正!A5,[1]費用支出!$O$10:$O$4011)+SUMIF([1]複合仕訳!$N$15:$W$15,A5,[1]複合仕訳!$N$4:$W$4)","v":0},{"$f":"SUMIF([1]費用支出!$X$10:$X$4011,仕入修正!A5,[1]費用支出!$AI$10:$AI$4011)+SUMIF([1]複合仕訳!$N$15:$W$15,A5,[1]複合仕訳!$N$7:$W$7)","v":0},{"$f":"L5-M5","v":0},{"$f":"SUMIF([1]費用支出!$AM$10:$AM$4011,仕入修正!G5,[1]費用支出!$O$10:$O$4011)+SUMIF([1]複合仕訳!$AO$15:$AX$15,G5,[1]複合仕訳!$AO$17:$AX$17)","v":0},{"$f":"SUMIF([1]費用支出!$AM$10:$AM$4011,仕入修正!H5,[1]費用支出!$O$10:$O$4011)+SUMIF([1]複合仕訳!$AO$16:$AX$16,H5,[1]複合仕訳!$AO$18:$AX$18)","v":0},null,{"$f":"IF(OR(最初!C8=0,最初!C8=\"\"),\"\",VLOOKUP(最初!C8,最初!$D$12:$E$14,2,0))","v":""},null,null,null,null,"納税義務の免除を受けない（受ける）こととなった場合における消費税額の調整（加算又は減算）額"]
[2,3,null,null,null,null,null,null,null,null,{"$f":"IF(L6=0,\"***\",+[1]ﾒﾆｭｰ!H5)","v":"***"},{"$f":"L44+L45","v":0},{"$f":"M44+M45","v":0},0,{"$f":"O44+O45","v":0},{"$f":"P44+P45","v":0}]
[4,5,6,null,null,null,null,null,null,null,{"$f":"IF(L7=0,\"***\",\"素畜費\")","v":"***"},{"$f":"L46+L47+L48","v":0},{"$f":"M46+M47+M48","v":0},0,{"$f":"O46+O47+O48","v":0},{"$f":"P46+P47+P48","v":0}]
[7,null,null,null,1,2,{"$f":"$A8*10+E8","v":71},{"$f":"$A8*10+F8","v":72},null,null,{"$f":"IF(L8=0,\"***\",+[1]ﾒﾆｭｰ!H10)","v":"***"},{"$f":"SUMIF([1]費用支出!$X$10:$X$4011,仕入修正!A8,[1]費用支出!$O$10:$O$4011)+SUMIF([1]複合仕訳!$N$15:$W$15,A8,[1]複合仕訳!$N$4:$W$4)","v":0},{"$f":"SUMIF([1]費用支出!$X$10:$X$4011,仕入修正!A8,[1]費用支出!$AI$10:$AI$4011)+SUMIF([1]複合仕訳!$N$15:$W$15,A8,[1]複合仕訳!$N$7:$W$7)","v":0},0,{"$f":"SUMIF([1]費用支出!$AM$10:$AM$4011,仕入修正!G8,[1]費用支出!$O$10:$O$4011)+SUMIF([1]複合仕訳!$AO$15:$AX$15,G8,[1]複合仕訳!$AO$17:$AX$17)","v":0},{"$f":"SUMIF([1]費用支出!$AM$10:$AM$4011,仕入修正!H8,[1]費用支出!$O$10:$O$4011)+SUMIF([1]複合仕訳!$AO$16:$AX$16,H8,[1]複合仕訳!$AO$18:$AX$18)","v":0}]
{"$rows_left_out":45}
{"sheet":"取引計算表","index":3,"n_rows":46,"n_cols":17,"rows_kept":46,"cut":false,"hidden":false,"merged":[[1,7,2,7],[29,15,30,15],[25,11,31,11],[25,12,31,12],[25,13,28,13],[27,14,28,14],[29,13,30,13],[29,14,30,14],[27,15,28,15],[12,11,17,15],[12,16,17,16],[22,15,23,15],[20,15,21,15],[6,2,6,3],[8,2,8,3],[18,11,24,11],[18,12,24,12],[18,13,21,13],[20,14,21,14],[22,13,23,13],[22,14,23,14],[2,1,2,4],[3,1,11,1],[4,4,5,4],[44,2,44,3],[38,2,38,3],[39,2,39,3],[40,2,40,3],[4,2,4,3],[3,2,3,3],[5,2,5,3],[45,1,45,2],[12,1,44,1],[43,2,43,3],[9,2,10,2],[41,2,42,2]]}
[]
[null,"課税取引金額計算表（農業所得用《３種事業》）",null,null,null,null,null,"C(A-B）\n課税取引金額"]
[null,"科目",null,null,null,"A：　決算額","B：　Aのうち課税取引にならないもの",null,"うち税率4％適用分","うち税率6.3％適用分"]
[null,"収入金額","販売金額",null,1,{"$f":"売上修正!M6+売上修正!M10+売上修正!M11+売上修正!M12","v":0},{"$f":"SUM(売上修正!N6:O6,売上修正!N10:O12)","v":0},{"$f":"F4-G4","v":0},{"$f":"売上修正!Q6+売上修正!Q10+売上修正!Q11+売上修正!Q12","v":0},{"$f":"売上修正!R6+売上修正!R10+売上修正!R11+売上修正!R12","v":0}]
[null,null,"家事消費",null,2,{"$f":"売上修正!M7","v":0},{"$f":"売上修正!N7+売上修正!O7","v":0},{"$f":"F5-G5","v":0},{"$f":"売上修正!Q7","v":0},{"$f":"売上修正!R7","v":0}]
[null,null,"事業消費"]
[null,null,"雑収入",null,3,{"$f":"売上修正!M8+売上修正!M9","v":0},{"$f":"売上修正!N8+売上修正!O8+売上修正!N9+売上修正!O9","v":0},{"$f":"F7-G7","v":0},{"$f":"売上修正!Q8+売上修正!Q9","v":0},{"$f":"売上修正!R8+売上修正!R9","v":0}]
[null,null,"未成熟果樹収入",null,null,null,null,{"$f":"F8-G8","v":0}]
{"$rows_left_out":39}
{"sheet":"売上仕入計算","index":4,"n_rows":21,"n_cols":14,"rows_kept":21,"cut":false,"hidden":false,"merged":[[3,10,4,11],[17,1,17,2],[17,8,17,9],[18,8,20,8],[8,1,10,1],[8,8,10,8],[11,1,13,1],[11,8,13,8],[14,1,16,1],[4,1,4,2],[4,8,4,9],[14,8,16,8],[5,1,7,1],[5,8,7,8],[3,3,4,4],[18,11,18,13],[19,11,19,13],[20,11,20,13],[18,1,20,1],[18,4,18,6],[19,4,19,6],[20,4,20,6]]}
[]
[]
[]
[null,null,"課税売上高計算表","金額",null,null,null,null,null,"課税仕入高計算表","金額"]
[null,"項目",null,null,null,"うち税率4％適用分","うち税率6.3％適用分",null,"項目",null,null,null,"うち税率4％適用分","うち税率6.3％適用分"]
[null,"事業所得に係る課税売上高","損益計算書の売上(収入）金額",1,{"$f":"売上修正!M13","v":0},null,null,null,"事業所得に係る課税仕入高","損益計算書の仕入金額と経費の金額の合計",1,{"$f":"仕入修正!L33","v":0}]
[null,null,"１　のうち課税売上にならないもの",2,{"$f":"売上修正!N13+売上修正!O13","v":0},null,null,null,null,"１　のうち課税仕入にならないもの",2,{"$f":"仕入修正!M33","v":0}]
[null,null,"差引課税売上高",3,{"$f":"E6-E7","v":0},{"$f":"売上修正!Q13","v":0},{"$f":"売上修正!R13","v":0},null,null,"差引課税仕入高",3,{"$f":"L6-L7","v":0},{"$f":"仕入修正!O33","v":0},{"$f":"仕入修正!P33","v":0}]
{"$rows_left_out":14}
{"sheet":"本則付表1","index":5,"n_rows":39,"n_cols":12,"rows_kept":39,"cut":false,"hidden":false,"merged":[[38,10,38,11],[25,4,26,5],[27,4,28,5],[29,4,30,5],[31,4,32,5],[33,4,34,5],[36,8,36,9],[36,10,36,11],[37,10,37,11],[35,4,36,5],[37,4,38,5],[37,6,38,7],[37,8,38,9],[34,8,34,9],[34,10,34,11],[35,6,35,7],[35,8,35,9],[35,10,35,11],[25,8,26,9],[33,2,34,2],[35,2,36,2],[33,1,36,1],[37,1,38,2],[34,6,34,7],[36,6,36,7],[23,1,24,2],[25,1,26,2],[27,2,28,2],[29,2,30,2],[27,1,30,1],[31,1,32,2],[29,3,30,3],[31,3,32,3],[33,3,34,3],[35,3,36,3],[37,3,38,3],[25,3,26,3],[27,3,28,3],[25,6,26,7],[24,4,24,5],[24,6,24,7],[13,2,14,2],[15,2,16,2],[17,2,18,2],[19,2,20,2],[21,1,22,2],[17,3,18,3],[19,3,20,3],[21,3,22,3],[23,3,24,3],[9,1,10,2],[9,3,10,3],[11,1,12,2],[11,3,12,3],[13,3,14,3],[15,3,16,3],[13,1,20,1],[32,10,32,11],[33,6,33,7],[33,8,33,9],[33,10,33,11],[31,6,32,7],[31,8,32,9],[30,6,30,7],[30,8,30,9],[30,10,30,11],[31,10,31,11],[28,6,28,7],[28,8,28,9],[28,10,28,11],[29,6,29,7],[29,8,29,9],[27,6,27,7],[27,8,27,9],[24,8,24,9],[24,10,24,11],[25,10,25,11],[22,4,22,5],[22,6,22,7],[22,8,22,9],[22,10,22,11],[23,4,23,5],[23,6,23,7],[23,8,23,9],[20,6,20,7],[20,8,20,9],[21,4,21,5],[21,6,21,7],[21,8,21,9],[21,10,21,11],[18,4,18,5],[18,6,18,7],[18,8,18,9],[18,10,18,11],[19,4,19,5],[19,6,19,7],[19,8,19,9],[19,10,19,11],[15,10,15,11],[16,4,16,5],[16,6,16,7],[16,8,16,9],[16,10,16,11],[17,4,17,5],[17,6,17,7],[17,8,17,9],[14,4,14,5],[14,6,14,7],[14,8,14,9],[15,4,15,5],[15,6,15,7],[15,8,15,9],[12,6,12,7],[12,8,12,9],[12,10,12,11],[13,4,13,5],[13,6,13,7],[13,8,13,9],[13,10,13,11],[9,4,9,5],[9,6,9,7],[9,8,9,9],[10,4,10,5],[10,6,10,7],[10,8,10,9],[5,2,5,3],[5,7,5,8],[5,9,5,11],[7,4,7,5],[7,6,7,7],[7,8,7,9],[5,4,5,6],[7,3,8,3],[7,1,8,2],[8,8,8,9],[6,10,6,11],[2,11,3,11],[6,1,6,3],[6,4,6,5],[6,6,6,7],[6,8,6,9],[29,10,29,11],[27,10,27,11],[26,10,26,11],[23,10,23,11],[20,10,20,11],[20,4,20,5],[17,10,17,11],[14,10,14,11],[11,10,11,11],[11,4,11,5],[11,6,11,7],[11,8,11,9],[12,4,12,5],[10,10,10,11],[9,10,9,11],[8,10,8,11],[7,10,7,11],[8,4,8,5],[8,6,8,7]]}
[]
[]
[null,"付表１　旧・新税率別、消費税額計算表",null,null,null,null,null,null,"経過措置対象課税資産の",null,null,"一般"]
[null,null,"兼地方消費税の課税標準となる消費税額計算表",null,null,null,null,null,"譲渡等を含む課税期間用"]
[]
[null,null,"課税期間",null,"　　　　年　　　　月　　　　日　～\n　　　　年　　　　月　　　　日",null,null,"氏名又は名称"]
[null,"区分",null,null,"税率3%適用分\nA",null,"税率4%適用分\nB",null,"税率6.3%適用分\nC",null,"合計　D\n（A　+　B　+　C)"]
[null,"課税標準額",null,"①","円",null,"円",null,"円",null,"※申告書の①欄へ　　円"]
{"$rows_left_out":32}
{"sheet":"本則付表2(2)","index":6,"n_rows":40,"n_cols":14,"rows_kept":40,"cut":false,"hidden":false,"merged":[[28,13,36,13],[34,2,37,2],[9,3,12,3],[9,2,18,2],[15,3,16,3],[19,2,20,7],[28,5,28,6],[29,5,29,6],[30,5,30,6],[21,2,25,2],[21,3,21,6],[22,3,23,6],[24,3,24,6],[25,3,25,6],[26,2,26,6],[27,2,27,6],[16,4,16,6],[40,2,40,11],[4,11,5,11],[17,3,18,6],[38,2,39,6],[38,7,39,7],[36,7,37,7],[34,3,35,6],[34,7,35,7],[36,3,37,6],[33,3,33,6],[32,2,33,2],[32,3,32,6],[31,4,31,6],[28,4,30,4],[28,2,31,3],[22,7,23,7],[19,8,20,8],[19,9,20,9],[19,10,20,10],[17,7,18,7],[17,8,18,8],[17,9,18,9],[17,10,18,10],[15,4,15,6],[13,3,14,6],[13,7,14,7],[13,8,14,8],[13,9,14,9],[13,10,14,10],[12,4,12,6],[11,4,11,6],[7,7,7,8],[7,10,7,11],[8,2,8,7],[9,4,10,6],[9,7,10,7]]}
[]
[]
[]
[null,null,null,null,"第28-(5)号様式"]
[null,null,null,null,"　付表２-(２)  課税売上割合・控除対象仕入税額等の計算表",null,null,null,null,null,null,"一 般"]
[null,null,null,null,"                   〔経過措置対象課税資産の譲渡等を含む課税期間用〕"]
[]
[null,null,null,null,null,null,"課税期間","　　　年　　月　　日～\n　　　年　　月　　日",null,"氏名又は名称"]
{"$rows_left_out":33}
{"sheet":"申告書本則","index":7,"n_rows":34,"n_cols":14,"rows_kept":34,"cut":false,"hidden":false,"merged":[[25,2,25,3],[17,1,17,3],[16,1,16,3],[20,1,21,2],[22,1,22,5],[23,1,24,2],[0,3,0,4],[1,3,1,4],[2,3,2,4],[5,1,5,5],[4,1,4,9],[14,8,16,8],[14,1,14,3],[16,11,16,13],[12,7,12,11],[33,1,33,3],[27,1,27,3],[28,1,28,3],[29,1,29,3],[30,1,31,2],[25,1,26,1],[26,2,26,3],[18,7,18,10],[18,11,18,13],[18,1,19,2],[14,7,16,7],[15,11,15,13],[14,11,14,13],[6,1,6,3],[7,1,7,3],[8,1,8,3],[8,7,8,11],[9,1,12,1],[10,2,10,3],[14,9,15,9],[15,1,15,3],[9,2,9,3],[12,2,12,3],[10,7,10,11],[13,1,13,3],[9,7,9,11],[11,7,11,11],[11,2,11,3],[20,8,20,9],[20,10,20,11],[20,12,20,13],[21,8,21,9],[21,10,21,11],[21,12,21,13],[22,10,22,11],[22,12,22,13],[23,8,23,9],[23,10,23,11],[23,12,23,13],[30,8,30,9],[30,10,30,11],[30,12,30,13],[31,8,31,9],[31,10,31,11],[31,12,31,13],[20,7,24,7],[25,7,29,7],[25,10,25,13],[26,10,26,13],[27,10,27,13],[28,10,28,13],[29,10,29,13],[28,8,28,9],[29,8,29,9],[26,8,26,9],[27,8,27,9],[24,8,24,9],[24,10,24,11],[24,12,24,13],[25,8,25,9],[22,8,22,9]]}
[]
[]
[]
[]
[null,"本則課税\n課税期間分の消費税及び地方消費税の確定申告書"]
[null,"この申告書による消費税の税額の計算"]
[null,"課税標準額",null,null,1,{"$f":"本則付表1!K9","v":0}]
[null,"消費税額",null,null,2,{"$f":"本則付表1!K11","v":0}]
{"$rows_left_out":27}
{"sheet":"申告書簡易","index":8,"n_rows":34,"n_cols":13,"rows_kept":34,"cut":false,"hidden":false,"merged":[[33,1,33,3],[27,1,27,3],[28,1,28,3],[29,1,29,3],[30,1,31,2],[0,1,0,2],[23,1,24,2],[4,1,4,8],[8,7,8,10],[12,7,12,10],[11,7,11,10],[17,1,17,3],[12,2,12,3],[15,1,15,3],[16,1,16,3],[20,1,20,3],[21,1,21,3],[22,1,22,5],[9,1,12,1],[13,1,13,3],[14,1,14,3],[25,2,25,3],[18,1,19,2],[11,2,11,3],[5,1,5,5],[6,1,6,3],[7,1,7,3],[8,1,8,3],[25,1,26,1],[9,2,9,3],[10,2,10,3],[26,2,26,3],[10,7,10,10],[9,7,9,10],[18,10,18,12],[23,10,23,12],[24,10,24,12],[21,10,21,12],[15,7,21,7],[16,10,16,12],[17,10,17,12],[15,10,15,12],[19,10,19,12],[20,10,20,12],[25,10,25,12],[26,10,26,12],[28,7,32,7],[28,9,28,12],[29,9,29,12],[30,9,30,12],[31,9,31,12],[32,9,32,12],[27,10,27,12],[23,7,27,7]]}
[]
[]
[]
[]
[null,"簡易課税\n課税期間分の消費税及び地方消費税の確定申告書"]
[null,"この申告書による消費税の税額の計算"]
[null,"課税標準額",null,null,1,{"$f":"簡易付表4!K10","v":0}]
[null,"消費税額",null,null,2,{"$f":"簡易付表4!K12","v":0}]
{"$rows_left_out":27}
{"sheet":"決算書不動産","index":9,"n_rows":16,"n_cols":9,"rows_kept":16,"cut":false,"hidden":true,"merged":[[12,5,12,6],[13,5,13,6],[14,5,14,6],[15,5,15,7],[1,2,1,7],[3,1,3,3],[3,5,3,7],[4,1,7,1],[4,5,9,5],[8,1,15,1],[10,5,10,6],[11,5,11,6]]}
[]
[null,null,"平成 18 年度分所得税青色申告決算書（不動産所得用） "]
[]
[null,"科            目",null,null,"金額","科                  目",null,null,"金額"]
[null,"収入金額","賃貸料",1,null,"必要経費",null,13]
[null,null,"礼金・権利金\n更新料",2,null,null,null,14]
[null,null,null,3,null,null,null,15]
[null,null,"計",4,{"$f":"SUM(決算書不動産!E5:E7)","v":0},null,null,16]
{"$rows_left_out":9}
{"sheet":"不動産売上仕入修正","index":10,"n_rows":28,"n_cols":13,"rows_kept":28,"cut":false,"hidden":true,"merged":[[0,2,0,6],[12,4,12,5],[12,6,13,7],[3,3,4,3],[3,2,4,2],[3,6,3,7],[12,3,13,3],[11,2,11,8],[12,13,13,13],[12,2,13,2],[2,1,2,8],[5,1,8,1],[3,1,4,1],[3,9,3,13],[12,8,13,8],[12,9,12,12],[3,8,4,8]]}
[]
[]
[null,"消費税関係課税売上計算書(不動産所得用）"]
[null,null,"科目名","金額",null,null,"B　：Aのうち課税取引にならないもの",null,"C(A-B)\n課税売上額","課税売上にならないもの"]
[null,null,null,null,null,null,"非課税取引","不課税取引",null,"非課税取引","非課税取引","非課税取引","不課税取引"]
[null,"５種事業",{"$f":"決算書不動産!C5","v":"賃貸料"},{"$f":"決算書不動産!E5","v":0},null,null,{"$f":"SUM(J6:L6)","v":0},null,{"$f":"D6-G6-H6","v":0}]
[null,null,{"$f":"決算書不動産!C6","v":"礼金・権利金\n更新料"},{"$f":"決算書不動産!E6","v":0},null,null,{"$f":"SUM(J7:L7)","v":0},null,{"$f":"D7-G7-H7","v":0}]
[null,null,{"$f":"決算書不動産!C7","v":0},{"$f":"決算書不動産!E7","v":0},null,null,{"$f":"SUM(J8:L8)","v":0},null,{"$f":"D8-G8-H8","v":0}]
{"$rows_left_out":21}
{"sheet":"簡易付表5(2)","index":11,"n_rows":94,"n_cols":15,"rows_kept":94,"cut":false,"hidden":false,"merged":[[0,5,0,7],[77,3,78,4],[77,5,78,5],[77,6,78,6],[79,3,80,4],[79,5,80,5],[79,6,80,6],[81,3,82,4],[71,3,72,4],[71,5,72,5],[71,6,72,6],[73,3,74,4],[73,5,74,5],[73,6,74,6],[75,3,76,4],[75,5,76,5],[75,6,76,6],[71,7,71,8],[68,3,68,6],[68,7,68,8],[52,4,53,5],[52,6,53,6],[52,7,52,8],[41,3,41,6],[92,3,93,5],[92,6,93,6],[87,3,88,4],[87,5,88,5],[87,6,88,6],[81,5,82,5],[81,6,82,6],[83,3,84,4],[83,5,84,5],[83,6,84,6],[85,3,86,4],[85,5,86,5],[85,6,86,6],[91,3,91,6],[84,11,84,12],[84,13,84,14],[85,7,85,8],[85,9,85,10],[92,11,92,12],[92,13,92,14],[93,7,93,8],[93,9,93,10],[93,11,93,12],[93,13,93,14],[87,7,87,8],[87,9,87,10],[87,11,87,12],[87,13,87,14],[88,7,88,8],[88,11,88,12],[88,13,88,14],[91,7,91,8],[91,9,91,10],[91,11,91,12],[91,13,91,14],[92,7,92,8],[92,9,92,10],[79,13,79,14],[80,7,80,8],[88,9,88,10],[80,11,80,12],[80,13,80,14],[81,7,81,8],[81,9,81,10],[81,11,81,12],[81,13,81,14],[79,7,79,8],[86,9,86,10],[85,11,85,12],[85,13,85,14],[86,7,86,8],[86,11,86,12],[86,13,86,14],[82,7,82,8],[82,11,82,12],[82,13,82,14],[83,7,83,8],[83,9,83,10],[83,11,83,12],[83,13,83,14],[84,7,84,8],[77,11,77,12],[77,13,77,14],[78,7,78,8],[84,9,84,10],[78,11,78,12],[78,13,78,14],[74,7,74,8],[76,9,76,10],[74,11,74,12],[74,13,74,14],[75,7,75,8],[78,9,78,10],[75,11,75,12],[75,13,75,14],[76,7,76,8],[80,9,80,10],[76,11,76,12],[76,13,76,14],[77,7,77,8],[82,9,82,10],[77,9,77,10],[75,9,75,10],[79,9,79,10],[79,11,79,12],[71,9,71,10],[71,11,71,12],[71,13,71,14],[72,7,72,8],[72,9,72,10],[72,11,72,12],[72,13,72,14],[73,7,73,8],[74,9,74,10],[73,11,73,12],[73,13,73,14],[73,9,73,10],[68,9,68,10],[68,11,68,12],[68,13,68,14],[69,3,70,4],[69,5,70,5],[69,6,70,6],[69,7,69,8],[69,9,69,10],[69,11,69,12],[69,13,69,14],[70,7,70,8],[70,9,70,10],[70,11,70,12],[70,13,70,14],[52,9,52,10],[52,11,52,12],[29,4,30,5],[31,4,32,5],[33,4,34,5],[35,4,36,5],[35,7,35,8],[36,7,36,8],[36,9,36,10],[36,11,36,12],[37,4,38,5],[37,6,38,6],[37,7,37,8],[30,7,30,8],[30,9,30,10],[30,11,30,12],[44,4,45,5],[46,4,47,5],[48,4,49,5],[50,4,51,5],[34,7,34,8],[46,6,47,6],[46,7,46,8],[46,9,46,10],[52,13,52,14],[53,7,53,8],[53,9,53,10],[53,11,53,12],[53,13,53,14],[44,3,53,3],[64,13,64,14],[65,7,65,8],[65,9,65,10],[65,11,65,12],[65,13,65,14],[63,3,63,6],[63,7,63,8],[63,9,63,10],[63,11,63,12],[63,13,63,14],[64,3,65,5],[64,6,65,6],[64,7,64,8],[64,9,64,10],[64,11,64,12],[58,13,58,14],[59,7,59,8],[59,9,59,10],[59,11,59,12],[59,13,59,14],[57,3,57,6],[57,7,57,8],[57,9,57,10],[57,11,57,12],[57,13,57,14],[58,3,59,5],[58,6,59,6],[58,7,58,8],[58,9,58,10],[58,11,58,12],[48,13,48,14],[49,7,49,8],[49,9,49,10],[49,11,49,12],[49,13,49,14],[50,6,51,6],[50,7,50,8],[50,9,50,10],[50,11,50,12],[50,13,50,14],[51,7,51,8],[51,9,51,10],[51,11,51,12],[51,13,51,14],[48,6,49,6],[48,7,48,8],[48,9,48,10],[48,11,48,12],[46,11,46,12],[46,13,46,14],[47,7,47,8],[47,9,47,10],[47,11,47,12],[47,13,47,14],[44,6,45,6],[44,7,44,8],[44,9,44,10],[44,11,44,12],[44,13,44,14],[45,7,45,8],[45,9,45,10],[45,11,45,12],[45,13,45,14],[38,9,38,10],[38,11,38,12],[34,9,34,10],[34,11,34,12],[42,13,42,14],[43,7,43,8],[43,9,43,10],[43,11,43,12],[43,13,43,14],[41,7,41,8],[41,9,41,10],[41,11,41,12],[41,13,41,14],[35,9,35,10],[29,6,30,6],[29,7,29,8],[29,9,29,10],[29,11,29,12],[42,3,43,5],[42,6,43,6],[31,6,32,6],[33,6,34,6],[35,6,36,6],[42,9,42,10],[42,11,42,12],[37,9,37,10],[37,11,37,12],[38,7,38,8],[29,3,38,3],[31,7,31,8],[31,9,31,10],[31,11,31,12],[32,7,32,8],[32,9,32,10],[32,11,32,12],[33,7,33,8],[42,7,42,8],[33,9,33,10],[26,3,26,6],[26,7,26,8],[26,9,26,10],[26,11,26,12],[26,13,26,14],[27,3,28,5],[27,6,28,6],[27,7,27,8],[27,9,27,10],[27,11,27,12],[28,7,28,8],[28,9,28,10],[28,11,28,12],[27,14,28,14],[21,3,22,5],[21,6,22,6],[21,7,21,8],[21,9,21,10],[21,11,21,12],[21,13,21,14],[22,7,22,8],[22,9,22,10],[22,11,22,12],[22,13,22,14],[17,7,17,8],[17,9,17,10],[17,11,17,12],[17,13,17,14],[20,3,20,6],[20,7,20,8],[20,9,20,10],[20,11,20,12],[20,13,20,14],[16,7,16,8],[16,9,16,10],[16,11,16,12],[16,13,16,14],[13,7,13,8],[13,9,13,10],[13,11,13,12],[13,13,13,14],[14,7,14,8],[14,9,14,10],[14,11,14,12],[14,13,14,14],[11,11,11,12],[11,13,11,14],[12,7,12,8],[12,9,12,10],[12,11,12,12],[12,13,12,14],[15,7,15,8],[15,9,15,10],[15,11,15,12],[15,13,15,14],[33,11,33,12],[35,11,35,12],[3,13,4,13],[9,3,9,6],[10,3,11,5],[12,3,13,5],[14,3,15,5],[16,3,17,5],[10,6,11,6],[12,6,13,6],[14,6,15,6],[16,6,17,6],[9,13,9,14],[9,11,9,12],[9,9,9,10],[9,7,9,8],[6,8,6,10],[6,12,6,14],[10,7,10,8],[10,9,10,10],[10,11,10,12],[10,13,10,14],[11,7,11,8],[11,9,11,10]]}
[null,null,null,null,null,"事業種類判定　１：１種類　２：２種類以上",null,null,{"$f":"IF(J1>=2,2,J1)","v":0},{"$f":"COUNTIF(N31:N39,\">0\")","v":0}]
[]
[]
[null,null,null,"第28-⑺号様式",null,null,null,null,null,null,null,null,null,"簡易"]
[null,null,null,"付表５-⑵ 控除対象仕入税額等の計算表〔経過措置対象課税資産の譲渡等を含む課税期間用〕"]
[]
[null,null,null,null,null,null,null,"課税期間","　　　　　年　　月　　日　～\n　　　　　年　　月　　日",null,null,"氏名又は名称"]
[]
{"$rows_left_out":87}
{"sheet":"簡易付表4","index":12,"n_rows":40,"n_cols":12,"rows_kept":40,"cut":false,"hidden":false,"merged":[[7,6,7,7],[7,8,7,9],[7,10,7,11],[3,11,4,11],[10,1,11,2],[10,3,11,3],[12,1,13,2],[12,3,13,3],[14,2,15,2],[10,4,10,5],[10,6,10,7],[10,8,10,9],[13,4,13,5],[8,1,9,2],[8,3,9,3],[8,4,8,5],[8,6,8,7],[8,8,8,9],[8,10,8,11],[9,4,9,5],[9,6,9,7],[9,8,9,9],[9,10,9,11],[6,5,6,7],[6,9,6,11],[7,1,7,3],[7,4,7,5],[14,3,15,3],[16,3,17,3],[18,3,19,3],[20,3,21,3],[22,3,23,3],[24,3,25,3],[10,10,10,11],[11,4,11,5],[11,6,11,7],[11,8,11,9],[11,10,11,11],[12,4,12,5],[12,6,12,7],[12,8,12,9],[12,10,12,11],[15,4,15,5],[15,6,15,7],[15,8,15,9],[15,10,15,11],[16,4,16,5],[16,6,16,7],[26,3,27,3],[26,1,27,2],[28,2,29,2],[28,1,33,1],[16,2,17,2],[18,2,19,2],[20,2,21,2],[14,1,21,1],[22,1,23,2],[24,1,25,2],[28,3,29,3],[30,3,31,3],[32,3,33,3],[34,3,35,3],[36,3,37,3],[38,3,39,3],[36,2,37,2],[34,1,37,1],[38,1,39,2],[30,2,31,2],[32,2,33,2],[34,2,35,2],[16,8,16,9],[16,10,16,11],[13,6,13,7],[13,8,13,9],[13,10,13,11],[14,4,14,5],[14,6,14,7],[14,8,14,9],[14,10,14,11],[19,4,19,5],[19,6,19,7],[19,8,19,9],[19,10,19,11],[20,4,20,5],[20,6,20,7],[20,8,20,9],[20,10,20,11],[17,4,17,5],[17,6,17,7],[17,8,17,9],[17,10,17,11],[18,4,18,5],[18,6,18,7],[18,8,18,9],[18,10,18,11],[23,4,23,5],[23,6,23,7],[23,8,23,9],[23,10,23,11],[24,4,24,5],[24,6,24,7],[24,8,24,9],[24,10,24,11],[21,4,21,5],[21,6,21,7],[21,8,21,9],[21,10,21,11],[22,4,22,5],[22,6,22,7],[22,8,22,9],[22,10,22,11],[27,10,27,11],[28,6,28,7],[28,8,28,9],[28,10,28,11],[25,4,25,5],[25,6,25,7],[25,8,25,9],[25,10,25,11],[26,10,26,11],[34,8,34,9],[34,10,34,11],[32,6,33,7],[32,8,33,9],[31,6,31,7],[31,8,31,9],[31,10,31,11],[32,10,32,11],[29,6,29,7],[29,8,29,9],[29,10,29,11],[30,6,30,7],[30,8,30,9],[30,10,30,11],[38,6,39,7],[38,8,39,9],[39,10,39,11],[26,4,27,5],[26,6,27,7],[26,8,27,9],[28,4,29,5],[30,4,31,5],[32,4,33,5],[37,6,37,7],[37,8,37,9],[37,10,37,11],[38,10,38,11],[36,4,37,5],[38,4,39,5],[35,6,35,7],[35,8,35,9],[35,10,35,11],[36,6,36,7],[36,8,36,9],[36,10,36,11],[34,4,35,5],[33,10,33,11],[34,6,34,7]]}
[]
[]
[null,"第28-⑹号様式"]
[null,null,"付表４ 　　旧・新税率別、消費税額計算表",null,null,null,null,"経過措置対象課税資産の",null,null,null,"簡易"]
[null,null,"　　　　　　　兼地方消費税の課税標準となる消費税額計算表",null,null,null,null,"譲渡等を含む課税期間用"]
[]
[null,null,null,null,"課税期間","　　　　　年　　月　　日　～\n　　　　　年　　月　　日",null,null,"氏名又は名称"]
[null,"項目",null,null,"税率3%適用分\nA",null,"税率4%適用分\nB",null,"税率6.3%適用分\nC",null,"合計　D\n（A　+　B　+　C)"]
{"$rows_left_out":33}
{"sheet":"その他","index":13,"n_rows":0,"n_cols":0,"rows_kept":0,"cut":false,"hidden":false,"merged":[]}

{"sheet":"作業表紙","index":14,"n_rows":14,"n_cols":4,"rows_kept":14,"cut":false,"hidden":false,"merged":[[1,1,2,4],[7,1,8,4],[3,1,4,4],[5,1,6,4]]}
[]
[null,"お待ちください！"]
[]
[null,"行数変更は、2分から10分程度かかります！"]
[]
[null,"年度更新は、10分程度かかります！"]
[]
[null,"複式簿記作成は、1時間程度かかります！"]
{"$rows_left_out":6}